| 1 | 0:01.98 Clobber not needed.
|
|---|
| 2 | 0:02.00 Adding make options from /sources/seamonkey/seamonkey-2.53.14/mozconfig
|
|---|
| 3 | MOZ_OBJDIR=/sources/seamonkey/seamonkey-2.53.14/obj-x86_64-pc-linux-gnu
|
|---|
| 4 | OBJDIR=/sources/seamonkey/seamonkey-2.53.14/obj-x86_64-pc-linux-gnu
|
|---|
| 5 | FOUND_MOZCONFIG=/sources/seamonkey/seamonkey-2.53.14/mozconfig
|
|---|
| 6 | export FOUND_MOZCONFIG
|
|---|
| 7 | 0:02.00 /usr/bin/make -f client.mk -s configure
|
|---|
| 8 | 0:02.01 cd /sources/seamonkey/seamonkey-2.53.14/obj-x86_64-pc-linux-gnu
|
|---|
| 9 | 0:02.01 /sources/seamonkey/seamonkey-2.53.14/configure
|
|---|
| 10 | 0:02.09 Creating Python 2 environment
|
|---|
| 11 | 0:04.19 New python executable in /sources/seamonkey/seamonkey-2.53.14/obj-x86_64-pc-linux-gnu/_virtualenvs/init/bin/python2.7
|
|---|
| 12 | 0:04.19 Also creating executable in /sources/seamonkey/seamonkey-2.53.14/obj-x86_64-pc-linux-gnu/_virtualenvs/init/bin/python
|
|---|
| 13 | 0:04.19 Installing setuptools, pip, wheel...
|
|---|
| 14 | 0:04.19 done.
|
|---|
| 15 | 0:05.53 running build_ext
|
|---|
| 16 | 0:05.53 building 'psutil._psutil_linux' extension
|
|---|
| 17 | 0:05.53 creating build
|
|---|
| 18 | 0:05.53 creating build/temp.linux-x86_64-2.7
|
|---|
| 19 | 0:05.53 creating build/temp.linux-x86_64-2.7/psutil
|
|---|
| 20 | 0:05.53 gcc -fno-strict-aliasing -g -O2 -DNDEBUG -g -fwrapv -O3 -Wall -Wstrict-prototypes -fPIC -DPSUTIL_POSIX=1 -DPSUTIL_SIZEOF_PID_T=4 -DPSUTIL_VERSION=570 -DPSUTIL_LINUX=1 -I/usr/include/python2.7 -c psutil/_psutil_common.c -o build/temp.linux-x86_64-2.7/psutil/_psutil_common.o
|
|---|
| 21 | 0:05.53 gcc -fno-strict-aliasing -g -O2 -DNDEBUG -g -fwrapv -O3 -Wall -Wstrict-prototypes -fPIC -DPSUTIL_POSIX=1 -DPSUTIL_SIZEOF_PID_T=4 -DPSUTIL_VERSION=570 -DPSUTIL_LINUX=1 -I/usr/include/python2.7 -c psutil/_psutil_posix.c -o build/temp.linux-x86_64-2.7/psutil/_psutil_posix.o
|
|---|
| 22 | 0:05.53 gcc -fno-strict-aliasing -g -O2 -DNDEBUG -g -fwrapv -O3 -Wall -Wstrict-prototypes -fPIC -DPSUTIL_POSIX=1 -DPSUTIL_SIZEOF_PID_T=4 -DPSUTIL_VERSION=570 -DPSUTIL_LINUX=1 -I/usr/include/python2.7 -c psutil/_psutil_linux.c -o build/temp.linux-x86_64-2.7/psutil/_psutil_linux.o
|
|---|
| 23 | 0:05.53 creating build/lib.linux-x86_64-2.7
|
|---|
| 24 | 0:05.53 creating build/lib.linux-x86_64-2.7/psutil
|
|---|
| 25 | 0:05.53 gcc -shared build/temp.linux-x86_64-2.7/psutil/_psutil_common.o build/temp.linux-x86_64-2.7/psutil/_psutil_posix.o build/temp.linux-x86_64-2.7/psutil/_psutil_linux.o -L/usr/lib -lpython2.7 -o build/lib.linux-x86_64-2.7/psutil/_psutil_linux.so
|
|---|
| 26 | 0:05.53 building 'psutil._psutil_posix' extension
|
|---|
| 27 | 0:05.53 gcc -fno-strict-aliasing -g -O2 -DNDEBUG -g -fwrapv -O3 -Wall -Wstrict-prototypes -fPIC -DPSUTIL_POSIX=1 -DPSUTIL_SIZEOF_PID_T=4 -DPSUTIL_VERSION=570 -DPSUTIL_LINUX=1 -I/usr/include/python2.7 -c psutil/_psutil_common.c -o build/temp.linux-x86_64-2.7/psutil/_psutil_common.o
|
|---|
| 28 | 0:05.53 gcc -fno-strict-aliasing -g -O2 -DNDEBUG -g -fwrapv -O3 -Wall -Wstrict-prototypes -fPIC -DPSUTIL_POSIX=1 -DPSUTIL_SIZEOF_PID_T=4 -DPSUTIL_VERSION=570 -DPSUTIL_LINUX=1 -I/usr/include/python2.7 -c psutil/_psutil_posix.c -o build/temp.linux-x86_64-2.7/psutil/_psutil_posix.o
|
|---|
| 29 | 0:05.53 gcc -shared build/temp.linux-x86_64-2.7/psutil/_psutil_common.o build/temp.linux-x86_64-2.7/psutil/_psutil_posix.o -L/usr/lib -lpython2.7 -o build/lib.linux-x86_64-2.7/psutil/_psutil_posix.so
|
|---|
| 30 | 0:05.53 copying build/lib.linux-x86_64-2.7/psutil/_psutil_linux.so -> psutil
|
|---|
| 31 | 0:05.53 copying build/lib.linux-x86_64-2.7/psutil/_psutil_posix.so -> psutil
|
|---|
| 32 | 0:05.53
|
|---|
| 33 | 0:05.53 Error processing command. Ignoring because optional. (optional:packages.txt:comm/build/virtualenv_packages.txt)
|
|---|
| 34 | 0:05.53 Reexecuting in the virtualenv
|
|---|
| 35 | 0:05.71 Adding configure options from /sources/seamonkey/seamonkey-2.53.14/mozconfig
|
|---|
| 36 | 0:05.71 --disable-dbus
|
|---|
| 37 | 0:05.71 --disable-necko-wifi
|
|---|
| 38 | 0:05.71 --disable-gconf
|
|---|
| 39 | 0:05.71 --with-system-icu
|
|---|
| 40 | 0:05.71 --with-system-libevent
|
|---|
| 41 | 0:05.71 --with-system-nspr
|
|---|
| 42 | 0:05.71 --with-system-nss
|
|---|
| 43 | 0:05.71 --with-system-webp
|
|---|
| 44 | 0:05.71 --disable-debug-symbols
|
|---|
| 45 | 0:05.71 --disable-elf-hack
|
|---|
| 46 | 0:05.71 --enable-calendar
|
|---|
| 47 | 0:05.71 --enable-dominspector
|
|---|
| 48 | 0:05.72 --enable-irc
|
|---|
| 49 | 0:05.72 --prefix=/usr
|
|---|
| 50 | 0:05.72 --enable-application=comm/suite
|
|---|
| 51 | 0:05.72 --disable-crashreporter
|
|---|
| 52 | 0:05.72 --disable-updater
|
|---|
| 53 | 0:05.72 --disable-tests
|
|---|
| 54 | 0:05.72 --disable-rust-simd
|
|---|
| 55 | 0:05.72 --enable-optimize=-O2
|
|---|
| 56 | 0:05.72 --enable-strip
|
|---|
| 57 | 0:05.72 --enable-install-strip
|
|---|
| 58 | 0:05.72 --enable-official-branding
|
|---|
| 59 | 0:05.72 --enable-system-ffi
|
|---|
| 60 | 0:05.72 --enable-system-pixman
|
|---|
| 61 | 0:05.72 --with-system-bz2
|
|---|
| 62 | 0:05.72 --with-system-jpeg
|
|---|
| 63 | 0:05.72 --with-system-png
|
|---|
| 64 | 0:05.72 --with-system-zlib
|
|---|
| 65 | 0:05.72 BASH_ARGC=([0]="4")
|
|---|
| 66 | 0:05.72 BASH_ARGV=([0]="/sources/seamonkey/seamonkey-2.53.14/python/mozbuild/mozbuild/action/dump_env.py" [1]="/sources/seamonkey/seamonkey-2.53.14/obj-x86_64-pc-linux-gnu/_virtualenvs/init/bin/python" [2]="/sources/seamonkey/seamonkey-2.53.14/mozconfig" [3]="/sources/seamonkey/seamonkey-2.53.14")
|
|---|
| 67 | 0:05.74 checking for Python 3... Creating Python 3 environment
|
|---|
| 68 | 0:06.78 Using base prefix '/usr'
|
|---|
| 69 | 0:06.78 New python executable in /sources/seamonkey/seamonkey-2.53.14/obj-x86_64-pc-linux-gnu/_virtualenvs/init_py3/bin/python3
|
|---|
| 70 | 0:06.78 Also creating executable in /sources/seamonkey/seamonkey-2.53.14/obj-x86_64-pc-linux-gnu/_virtualenvs/init_py3/bin/python
|
|---|
| 71 | 0:06.78 ERROR: The executable /sources/seamonkey/seamonkey-2.53.14/obj-x86_64-pc-linux-gnu/_virtualenvs/init_py3/bin/python3 is not functioning
|
|---|
| 72 | 0:06.78 ERROR: It thinks sys.prefix is '/usr' (should be '/sources/seamonkey/seamonkey-2.53.14/obj-x86_64-pc-linux-gnu/_virtualenvs/init_py3')
|
|---|
| 73 | 0:06.78 ERROR: virtualenv is not compatible with this system or executable
|
|---|
| 74 | 0:06.79 DEBUG: python3: running with pid 30818
|
|---|
| 75 | 0:06.79 DEBUG: python3: sys.executable: '/sources/seamonkey/seamonkey-2.53.14/obj-x86_64-pc-linux-gnu/_virtualenvs/init/bin/python'
|
|---|
| 76 | 0:06.79 DEBUG: python3: executable from configuration: None
|
|---|
| 77 | 0:06.79 DEBUG: python3: found executable: u'/usr/bin/python3'
|
|---|
| 78 | 0:06.79 DEBUG: python3: using venv: u'/sources/seamonkey/seamonkey-2.53.14/obj-x86_64-pc-linux-gnu/_virtualenvs/init_py3'
|
|---|
| 79 | 0:06.79 Traceback (most recent call last):
|
|---|
| 80 | 0:06.79 File "/sources/seamonkey/seamonkey-2.53.14/configure.py", line 167, in <module>
|
|---|
| 81 | 0:06.79 sys.exit(main(sys.argv))
|
|---|
| 82 | 0:06.79 File "/sources/seamonkey/seamonkey-2.53.14/configure.py", line 40, in main
|
|---|
| 83 | 0:06.79 sandbox.run(os.path.join(os.path.dirname(__file__), 'moz.configure'))
|
|---|
| 84 | 0:06.79 File "/sources/seamonkey/seamonkey-2.53.14/python/mozbuild/mozbuild/configure/__init__.py", line 446, in run
|
|---|
| 85 | 0:06.79 self.include_file(path)
|
|---|
| 86 | 0:06.79 File "/sources/seamonkey/seamonkey-2.53.14/python/mozbuild/mozbuild/configure/__init__.py", line 437, in include_file
|
|---|
| 87 | 0:06.79 exec_(code, self)
|
|---|
| 88 | 0:06.79 File "/sources/seamonkey/seamonkey-2.53.14/python/mozbuild/mozbuild/util.py", line 56, in exec_
|
|---|
| 89 | 0:06.79 exec(object, globals, locals)
|
|---|
| 90 | 0:06.79 File "/sources/seamonkey/seamonkey-2.53.14/moz.configure", line 7, in <module>
|
|---|
| 91 | 0:06.79 include('build/moz.configure/init.configure')
|
|---|
| 92 | 0:06.79 File "/sources/seamonkey/seamonkey-2.53.14/python/mozbuild/mozbuild/configure/__init__.py", line 746, in include_impl
|
|---|
| 93 | 0:06.79 self.include_file(what)
|
|---|
| 94 | 0:06.79 File "/sources/seamonkey/seamonkey-2.53.14/python/mozbuild/mozbuild/configure/__init__.py", line 437, in include_file
|
|---|
| 95 | 0:06.79 exec_(code, self)
|
|---|
| 96 | 0:06.79 File "/sources/seamonkey/seamonkey-2.53.14/python/mozbuild/mozbuild/util.py", line 56, in exec_
|
|---|
| 97 | 0:06.79 exec(object, globals, locals)
|
|---|
| 98 | 0:06.79 File "/sources/seamonkey/seamonkey-2.53.14/build/moz.configure/init.configure", line 436, in <module>
|
|---|
| 99 | 0:06.79 @imports(_from='mozbuild.pythonutil', _import='python_executable_version')
|
|---|
| 100 | 0:06.79 File "/sources/seamonkey/seamonkey-2.53.14/python/mozbuild/mozbuild/configure/__init__.py", line 729, in decorator
|
|---|
| 101 | 0:06.79 depends = DependsFunction(self, func, dependencies, when=when)
|
|---|
| 102 | 0:06.79 File "/sources/seamonkey/seamonkey-2.53.14/python/mozbuild/mozbuild/configure/__init__.py", line 134, in __init__
|
|---|
| 103 | 0:06.79 sandbox._value_for(self)
|
|---|
| 104 | 0:06.79 File "/sources/seamonkey/seamonkey-2.53.14/python/mozbuild/mozbuild/configure/__init__.py", line 521, in _value_for
|
|---|
| 105 | 0:06.79 return self._value_for_depends(obj)
|
|---|
| 106 | 0:06.79 File "/sources/seamonkey/seamonkey-2.53.14/python/mozbuild/mozbuild/util.py", line 981, in method_call
|
|---|
| 107 | 0:06.79 cache[args] = self.func(instance, *args)
|
|---|
| 108 | 0:06.79 File "/sources/seamonkey/seamonkey-2.53.14/python/mozbuild/mozbuild/configure/__init__.py", line 530, in _value_for_depends
|
|---|
| 109 | 0:06.79 value = obj.result()
|
|---|
| 110 | 0:06.79 File "/sources/seamonkey/seamonkey-2.53.14/python/mozbuild/mozbuild/util.py", line 981, in method_call
|
|---|
| 111 | 0:06.79 cache[args] = self.func(instance, *args)
|
|---|
| 112 | 0:06.79 File "/sources/seamonkey/seamonkey-2.53.14/python/mozbuild/mozbuild/configure/__init__.py", line 160, in result
|
|---|
| 113 | 0:06.79 return self._func(*resolved_args)
|
|---|
| 114 | 0:06.79 File "/sources/seamonkey/seamonkey-2.53.14/python/mozbuild/mozbuild/configure/__init__.py", line 1121, in wrapped
|
|---|
| 115 | 0:06.79 return new_func(*args, **kwargs)
|
|---|
| 116 | 0:06.79 File "/sources/seamonkey/seamonkey-2.53.14/python/mozbuild/mozbuild/configure/__init__.py", line 788, in wrapper
|
|---|
| 117 | 0:06.79 ret = template(*args, **kwargs)
|
|---|
| 118 | 0:06.79 File "/sources/seamonkey/seamonkey-2.53.14/build/moz.configure/checks.configure", line 58, in wrapped
|
|---|
| 119 | 0:06.79 ret = func(*args, **kwargs)
|
|---|
| 120 | 0:06.79 File "/sources/seamonkey/seamonkey-2.53.14/python/mozbuild/mozbuild/configure/__init__.py", line 1121, in wrapped
|
|---|
| 121 | 0:06.79 return new_func(*args, **kwargs)
|
|---|
| 122 | 0:06.79 File "/sources/seamonkey/seamonkey-2.53.14/build/moz.configure/init.configure", line 534, in virtualenv_python3
|
|---|
| 123 | 0:06.79 manager.build(python)
|
|---|
| 124 | 0:06.79 File "/sources/seamonkey/seamonkey-2.53.14/python/mozbuild/mozbuild/virtualenv.py", line 496, in build
|
|---|
| 125 | 0:06.79 self.create(python)
|
|---|
| 126 | 0:06.79 File "/sources/seamonkey/seamonkey-2.53.14/python/mozbuild/mozbuild/virtualenv.py", line 236, in create
|
|---|
| 127 | 0:06.79 self.virtualenv_root, result))
|
|---|
| 128 | 0:06.79 Exception: Failed to create virtualenv: /sources/seamonkey/seamonkey-2.53.14/obj-x86_64-pc-linux-gnu/_virtualenvs/init_py3 (virtualenv.py retcode: 100)
|
|---|
| 129 | 0:06.80 *** Fix above errors and then restart with\
|
|---|
| 130 | 0:06.80 "./mach build"
|
|---|
| 131 | 0:06.80 make: *** [client.mk:114: configure] Error 1
|
|---|