﻿id	summary	reporter	owner	description	type	status	priority	milestone	component	version	severity	resolution	keywords	cc
10771	maven does not build with java 10	Pierre Labastie	Pierre Labastie	"The end of the log is:
{{{
[INFO] ------------------------------------------------------------------------
[INFO] Reactor Summary:
[INFO] 
[INFO] Apache Maven 3.5.3 ................................. SUCCESS [ 26.231 s]
[INFO] Maven Model ........................................ FAILURE [  8.567 s]
[INFO] Maven Artifact ..................................... SKIPPED
[INFO] Maven Plugin API ................................... SKIPPED
[INFO] Maven Builder Support .............................. SKIPPED
[INFO] Maven Model Builder ................................ SKIPPED
[INFO] Maven Settings ..................................... SKIPPED
[INFO] Maven Settings Builder ............................. SKIPPED
[INFO] Maven Repository Metadata Model .................... SKIPPED
[INFO] Maven Artifact Resolver Provider ................... SKIPPED
[INFO] Maven Core ......................................... SKIPPED
[INFO] Maven SLF4J Simple Provider ........................ SKIPPED
[INFO] Maven Embedder ..................................... SKIPPED
[INFO] Maven Compat ....................................... SKIPPED
[INFO] Apache Maven Distribution 3.5.3 .................... SKIPPED
[INFO] ------------------------------------------------------------------------
[INFO] BUILD FAILURE
[INFO] ------------------------------------------------------------------------
[INFO] Total time: 36.754 s
[INFO] Finished at: 2018-05-15T17:45:59+02:00
[INFO] ------------------------------------------------------------------------
[ERROR] Failed to execute goal org.apache.maven.plugins:maven-surefire-plugin:2.20.1:test (default-test) on project maven-model: Execution default-test of goal org.apache.maven.plugins:maven-surefire-plugin:2.20.1:test failed.: NullPointerException -> [Help 1]
[ERROR] 
[ERROR] To see the full stack trace of the errors, re-run Maven with the -e switch.
[ERROR] Re-run Maven using the -X switch to enable full debug logging.
[ERROR] 
[ERROR] For more information about the errors and possible solutions, please read the following articles:
[ERROR] [Help 1] http://cwiki.apache.org/confluence/display/MAVEN/PluginExecutionException
[ERROR] 
[ERROR] After correcting the problems, you can resume the build with the command
[ERROR]   mvn <goals> -rf :maven-model
}}}
"	defect	closed	normal	8.3	BOOK	SVN	medium	fixed		
