﻿id	summary	reporter	owner	description	type	status	priority	milestone	component	version	severity	resolution	keywords	cc
1574	gcc compiler error ~	kenmimic@…	blfs-book@…	"I use Gcc3.4.0 ,binutil 2.15, glibc 2.3.2 and the error occur in Gcc compiler 
process. and the error show down below.


E-mail bug reports to: bonzini@gnu.org .
Be sure to include the word ``sed'' somewhere in the ``Subject:'' field.
/bin/sh: rc: command not found
make[3]: *** [libgcc.a] Error 127
make[3]: Leaving directory `/mics/work/gnu/build-dir/build-boot-gcc-3.4.0-
1/gcc'
make[2]: *** [stmp-multilib] Error 2
make[2]: Leaving directory `/mics/work/gnu/build-dir/build-boot-gcc-3.4.0-
1/gcc'
make[1]: *** [stage1_build] Error 2
make[1]: Leaving directory `/mics/work/gnu/build-dir/build-boot-gcc-3.4.0-
1/gcc'
make: *** [bootstrap] Error 2"	defect	closed	high		BOOK	~CVS	medium	worksforme		
