﻿id	summary	reporter	owner	description	type	status	priority	milestone	component	version	severity	resolution	keywords	cc
2850	error when compile which-2.19	caozhzh	blfs-book@…	"When I compile which-2.19
I encouraged the error below:

In file included from tilde.c:55:
xmalloc.h:29:31: error: readline/rlstdc.h: No such file or directory
make[2]: *** [tilde.o] Error 1
make[1]: *** [all-recursive] Error 1
make: *** [all] Error 2

so, I used the second option to get which work."	task	closed	normal		BOOK	SVN	medium	invalid		
