﻿id	summary	reporter	owner	description	type	status	priority	milestone	component	version	severity	resolution	keywords	cc
3329	Shadow will not build after installing acl and attr	Wayne Blaszczyk	DJ Lucas	"After installing attr and acl (BLFS Version 2012-04-09), I cannot build shadow (after installing linux-pam).
The following error occurs during make:

/bin/sh ../libtool --tag=CC   --mode=link gcc  -g -O2   -o useradd useradd.o   ../libmisc/libmisc.a ../lib/libshadow.la -lpam -lpam_misc    -lacl -lattr 
libtool: link: cannot find the library `/usr/usr/lib/libattr.la' or unhandled argument `/usr/usr/lib/libattr.la'
make[2]: *** [useradd] Error 1
make[2]: Leaving directory `/sources/shadow-4.1.5/src'
make[1]: *** [all-recursive] Error 1
make[1]: Leaving directory `/sources/shadow-4.1.5'
make: *** [all] Error 2

"	defect	closed	normal		BOOK	SVN	medium	fixed		
