﻿id	summary	reporter	owner	description	type	status	priority	milestone	component	version	severity	resolution	keywords	cc
359	xine-ui corrupted package	igor@…	blfs-book@…	"I'm getting the following errors when uncompressing xine-ui:

xine-ui-0.9.22/doc/README_en
tar: Octal value `20366603014' is out of range for time_t

xine-ui-0.9.22/doc/README_fr
tar: Octal value `20366603014' is out of range for time_t

tar: Error exit delayed from previous errors

Ignoring those and proceeding with the book instructions leads to:

make  all-recursive
make[1]: Entering directory `/home/igor/src/xine-ui-0.9.22'
Making all in doc
make[2]: Entering directory `/home/igor/src/xine-ui-0.9.22/doc'
Making all in man
make[3]: Entering directory `/home/igor/src/xine-ui-0.9.22/doc/man'
Making all in fr
make[4]: Entering directory `/home/igor/src/xine-ui-0.9.22/doc/man/fr'
make[4]: Nothing to be done for `all'.
make[4]: Leaving directory `/home/igor/src/xine-ui-0.9.22/doc/man/fr'
Making all in es
make[4]: Entering directory `/home/igor/src/xine-ui-0.9.22/doc/man/es'
make[4]: Nothing to be done for `all'.
make[4]: Leaving directory `/home/igor/src/xine-ui-0.9.22/doc/man/es'
Making all in en
make[4]: Entering directory `/home/igor/src/xine-ui-0.9.22/doc/man/en'
ln -s xine-check.1 xine-bugreport.1
make[4]: Leaving directory `/home/igor/src/xine-ui-0.9.22/doc/man/en'
Making all in pl
make[4]: Entering directory `/home/igor/src/xine-ui-0.9.22/doc/man/pl'
make[4]: Nothing to be done for `all'.
make[4]: Leaving directory `/home/igor/src/xine-ui-0.9.22/doc/man/pl'
Making all in de
make[4]: Entering directory `/home/igor/src/xine-ui-0.9.22/doc/man/de'
ln -s xine-check.1 xine-bugreport.1
make[4]: Leaving directory `/home/igor/src/xine-ui-0.9.22/doc/man/de'
make[4]: Entering directory `/home/igor/src/xine-ui-0.9.22/doc/man'
make[4]: Nothing to be done for `all-am'.
make[4]: Leaving directory `/home/igor/src/xine-ui-0.9.22/doc/man'
make[3]: Leaving directory `/home/igor/src/xine-ui-0.9.22/doc/man'
make[3]: Entering directory `/home/igor/src/xine-ui-0.9.22/doc'
make[3]: *** No rule to make target `README_cs', needed by `all-am'.  Stop.
make[3]: Leaving directory `/home/igor/src/xine-ui-0.9.22/doc'
make[2]: *** [all-recursive] Error 1
make[2]: Leaving directory `/home/igor/src/xine-ui-0.9.22/doc'
make[1]: *** [all-recursive] Error 1
make[1]: Leaving directory `/home/igor/src/xine-ui-0.9.22'
make: *** [all] Error 2"	defect	closed	highest		BOOK	~CVS	medium	fixed		
