﻿id	summary	reporter	owner	description	type	status	priority	milestone	component	version	severity	resolution	keywords	cc
9894	Fix gtk-doc	Douglas R. Reno	Douglas R. Reno	"With gtk-doc-1.26, I get the following error after installing all dependencies (including 'six' which was in Runtime)


{{{
gtk-doc was configured with the following options:
==================================================
configure:    PDF support disabled, no dblatex or fop available
configure: ** Syntax highlighting of examples enabled, using /usr/bin/highlight
configure:    Skipping regression tests
configure:    Debug tracing disabled
configure: ** Documentation enabled
Making all in cmake
make[1]: Entering directory '/sources/gtk-doc-1.26/gtk-doc-1.26/cmake'
make[1]: Nothing to be done for 'all'.
make[1]: Leaving directory '/sources/gtk-doc-1.26/gtk-doc-1.26/cmake'
Making all in help
make[1]: Entering directory '/sources/gtk-doc-1.26/gtk-doc-1.26/help'
Making all in manual
make[2]: Entering directory '/sources/gtk-doc-1.26/gtk-doc-1.26/help/manual'
  GEN      bn_IN/bn_IN.mo
  GEN    bn_IN/
  GEN      cs/cs.mo
  GEN    cs/
Error: Could not merge translations:
'NoneType' object has no attribute '__getitem__'
make[2]: *** [Makefile:523: cs/cs.stamp] Error 1
make[2]: Leaving directory '/sources/gtk-doc-1.26/gtk-doc-1.26/help/manual'
make[1]: *** [Makefile:370: all-recursive] Error 1
make[1]: Leaving directory '/sources/gtk-doc-1.26/gtk-doc-1.26/help'
make: *** [Makefile:733: all-recursive] Error 1
4.6 Elasped Time - gtk-doc-1.26
renodr [ /sources ]$
}}}

Creating this ticket to remind me to fix it."	defect	closed	normal	8.2	BOOK	SVN	medium	fixed		
