 0:01.98 Clobber not needed.
 0:02.00 Adding make options from /sources/seamonkey/seamonkey-2.53.14/mozconfig
    MOZ_OBJDIR=/sources/seamonkey/seamonkey-2.53.14/obj-x86_64-pc-linux-gnu
    OBJDIR=/sources/seamonkey/seamonkey-2.53.14/obj-x86_64-pc-linux-gnu
    FOUND_MOZCONFIG=/sources/seamonkey/seamonkey-2.53.14/mozconfig
    export FOUND_MOZCONFIG
 0:02.00 /usr/bin/make -f client.mk -s configure
 0:02.01 cd /sources/seamonkey/seamonkey-2.53.14/obj-x86_64-pc-linux-gnu
 0:02.01 /sources/seamonkey/seamonkey-2.53.14/configure
 0:02.09 Creating Python 2 environment
 0:04.19 New python executable in /sources/seamonkey/seamonkey-2.53.14/obj-x86_64-pc-linux-gnu/_virtualenvs/init/bin/python2.7
 0:04.19 Also creating executable in /sources/seamonkey/seamonkey-2.53.14/obj-x86_64-pc-linux-gnu/_virtualenvs/init/bin/python
 0:04.19 Installing setuptools, pip, wheel...
 0:04.19 done.
 0:05.53 running build_ext
 0:05.53 building 'psutil._psutil_linux' extension
 0:05.53 creating build
 0:05.53 creating build/temp.linux-x86_64-2.7
 0:05.53 creating build/temp.linux-x86_64-2.7/psutil
 0:05.53 gcc -fno-strict-aliasing -g -O2 -DNDEBUG -g -fwrapv -O3 -Wall -Wstrict-prototypes -fPIC -DPSUTIL_POSIX=1 -DPSUTIL_SIZEOF_PID_T=4 -DPSUTIL_VERSION=570 -DPSUTIL_LINUX=1 -I/usr/include/python2.7 -c psutil/_psutil_common.c -o build/temp.linux-x86_64-2.7/psutil/_psutil_common.o
 0:05.53 gcc -fno-strict-aliasing -g -O2 -DNDEBUG -g -fwrapv -O3 -Wall -Wstrict-prototypes -fPIC -DPSUTIL_POSIX=1 -DPSUTIL_SIZEOF_PID_T=4 -DPSUTIL_VERSION=570 -DPSUTIL_LINUX=1 -I/usr/include/python2.7 -c psutil/_psutil_posix.c -o build/temp.linux-x86_64-2.7/psutil/_psutil_posix.o
 0:05.53 gcc -fno-strict-aliasing -g -O2 -DNDEBUG -g -fwrapv -O3 -Wall -Wstrict-prototypes -fPIC -DPSUTIL_POSIX=1 -DPSUTIL_SIZEOF_PID_T=4 -DPSUTIL_VERSION=570 -DPSUTIL_LINUX=1 -I/usr/include/python2.7 -c psutil/_psutil_linux.c -o build/temp.linux-x86_64-2.7/psutil/_psutil_linux.o
 0:05.53 creating build/lib.linux-x86_64-2.7
 0:05.53 creating build/lib.linux-x86_64-2.7/psutil
 0:05.53 gcc -shared build/temp.linux-x86_64-2.7/psutil/_psutil_common.o build/temp.linux-x86_64-2.7/psutil/_psutil_posix.o build/temp.linux-x86_64-2.7/psutil/_psutil_linux.o -L/usr/lib -lpython2.7 -o build/lib.linux-x86_64-2.7/psutil/_psutil_linux.so
 0:05.53 building 'psutil._psutil_posix' extension
 0:05.53 gcc -fno-strict-aliasing -g -O2 -DNDEBUG -g -fwrapv -O3 -Wall -Wstrict-prototypes -fPIC -DPSUTIL_POSIX=1 -DPSUTIL_SIZEOF_PID_T=4 -DPSUTIL_VERSION=570 -DPSUTIL_LINUX=1 -I/usr/include/python2.7 -c psutil/_psutil_common.c -o build/temp.linux-x86_64-2.7/psutil/_psutil_common.o
 0:05.53 gcc -fno-strict-aliasing -g -O2 -DNDEBUG -g -fwrapv -O3 -Wall -Wstrict-prototypes -fPIC -DPSUTIL_POSIX=1 -DPSUTIL_SIZEOF_PID_T=4 -DPSUTIL_VERSION=570 -DPSUTIL_LINUX=1 -I/usr/include/python2.7 -c psutil/_psutil_posix.c -o build/temp.linux-x86_64-2.7/psutil/_psutil_posix.o
 0:05.53 gcc -shared build/temp.linux-x86_64-2.7/psutil/_psutil_common.o build/temp.linux-x86_64-2.7/psutil/_psutil_posix.o -L/usr/lib -lpython2.7 -o build/lib.linux-x86_64-2.7/psutil/_psutil_posix.so
 0:05.53 copying build/lib.linux-x86_64-2.7/psutil/_psutil_linux.so -> psutil
 0:05.53 copying build/lib.linux-x86_64-2.7/psutil/_psutil_posix.so -> psutil
 0:05.53 
 0:05.53 Error processing command. Ignoring because optional. (optional:packages.txt:comm/build/virtualenv_packages.txt)
 0:05.53 Reexecuting in the virtualenv
 0:05.71 Adding configure options from /sources/seamonkey/seamonkey-2.53.14/mozconfig
 0:05.71   --disable-dbus
 0:05.71   --disable-necko-wifi
 0:05.71   --disable-gconf
 0:05.71   --with-system-icu
 0:05.71   --with-system-libevent
 0:05.71   --with-system-nspr
 0:05.71   --with-system-nss
 0:05.71   --with-system-webp
 0:05.71   --disable-debug-symbols
 0:05.71   --disable-elf-hack
 0:05.71   --enable-calendar
 0:05.71   --enable-dominspector
 0:05.72   --enable-irc
 0:05.72   --prefix=/usr
 0:05.72   --enable-application=comm/suite
 0:05.72   --disable-crashreporter
 0:05.72   --disable-updater
 0:05.72   --disable-tests
 0:05.72   --disable-rust-simd
 0:05.72   --enable-optimize=-O2
 0:05.72   --enable-strip
 0:05.72   --enable-install-strip
 0:05.72   --enable-official-branding
 0:05.72   --enable-system-ffi
 0:05.72   --enable-system-pixman
 0:05.72   --with-system-bz2
 0:05.72   --with-system-jpeg
 0:05.72   --with-system-png
 0:05.72   --with-system-zlib
 0:05.72   BASH_ARGC=([0]="4")
 0:05.72   BASH_ARGV=([0]="/sources/seamonkey/seamonkey-2.53.14/python/mozbuild/mozbuild/action/dump_env.py" [1]="/sources/seamonkey/seamonkey-2.53.14/obj-x86_64-pc-linux-gnu/_virtualenvs/init/bin/python" [2]="/sources/seamonkey/seamonkey-2.53.14/mozconfig" [3]="/sources/seamonkey/seamonkey-2.53.14")
 0:05.74 checking for Python 3... Creating Python 3 environment
 0:06.78 Using base prefix '/usr'
 0:06.78 New python executable in /sources/seamonkey/seamonkey-2.53.14/obj-x86_64-pc-linux-gnu/_virtualenvs/init_py3/bin/python3
 0:06.78 Also creating executable in /sources/seamonkey/seamonkey-2.53.14/obj-x86_64-pc-linux-gnu/_virtualenvs/init_py3/bin/python
 0:06.78 ERROR: The executable /sources/seamonkey/seamonkey-2.53.14/obj-x86_64-pc-linux-gnu/_virtualenvs/init_py3/bin/python3 is not functioning
 0:06.78 ERROR: It thinks sys.prefix is '/usr' (should be '/sources/seamonkey/seamonkey-2.53.14/obj-x86_64-pc-linux-gnu/_virtualenvs/init_py3')
 0:06.78 ERROR: virtualenv is not compatible with this system or executable
 0:06.79 DEBUG: python3: running with pid 30818
 0:06.79 DEBUG: python3: sys.executable: '/sources/seamonkey/seamonkey-2.53.14/obj-x86_64-pc-linux-gnu/_virtualenvs/init/bin/python'
 0:06.79 DEBUG: python3: executable from configuration: None
 0:06.79 DEBUG: python3: found executable: u'/usr/bin/python3'
 0:06.79 DEBUG: python3: using venv: u'/sources/seamonkey/seamonkey-2.53.14/obj-x86_64-pc-linux-gnu/_virtualenvs/init_py3'
 0:06.79 Traceback (most recent call last):
 0:06.79   File "/sources/seamonkey/seamonkey-2.53.14/configure.py", line 167, in <module>
 0:06.79     sys.exit(main(sys.argv))
 0:06.79   File "/sources/seamonkey/seamonkey-2.53.14/configure.py", line 40, in main
 0:06.79     sandbox.run(os.path.join(os.path.dirname(__file__), 'moz.configure'))
 0:06.79   File "/sources/seamonkey/seamonkey-2.53.14/python/mozbuild/mozbuild/configure/__init__.py", line 446, in run
 0:06.79     self.include_file(path)
 0:06.79   File "/sources/seamonkey/seamonkey-2.53.14/python/mozbuild/mozbuild/configure/__init__.py", line 437, in include_file
 0:06.79     exec_(code, self)
 0:06.79   File "/sources/seamonkey/seamonkey-2.53.14/python/mozbuild/mozbuild/util.py", line 56, in exec_
 0:06.79     exec(object, globals, locals)
 0:06.79   File "/sources/seamonkey/seamonkey-2.53.14/moz.configure", line 7, in <module>
 0:06.79     include('build/moz.configure/init.configure')
 0:06.79   File "/sources/seamonkey/seamonkey-2.53.14/python/mozbuild/mozbuild/configure/__init__.py", line 746, in include_impl
 0:06.79     self.include_file(what)
 0:06.79   File "/sources/seamonkey/seamonkey-2.53.14/python/mozbuild/mozbuild/configure/__init__.py", line 437, in include_file
 0:06.79     exec_(code, self)
 0:06.79   File "/sources/seamonkey/seamonkey-2.53.14/python/mozbuild/mozbuild/util.py", line 56, in exec_
 0:06.79     exec(object, globals, locals)
 0:06.79   File "/sources/seamonkey/seamonkey-2.53.14/build/moz.configure/init.configure", line 436, in <module>
 0:06.79     @imports(_from='mozbuild.pythonutil', _import='python_executable_version')
 0:06.79   File "/sources/seamonkey/seamonkey-2.53.14/python/mozbuild/mozbuild/configure/__init__.py", line 729, in decorator
 0:06.79     depends = DependsFunction(self, func, dependencies, when=when)
 0:06.79   File "/sources/seamonkey/seamonkey-2.53.14/python/mozbuild/mozbuild/configure/__init__.py", line 134, in __init__
 0:06.79     sandbox._value_for(self)
 0:06.79   File "/sources/seamonkey/seamonkey-2.53.14/python/mozbuild/mozbuild/configure/__init__.py", line 521, in _value_for
 0:06.79     return self._value_for_depends(obj)
 0:06.79   File "/sources/seamonkey/seamonkey-2.53.14/python/mozbuild/mozbuild/util.py", line 981, in method_call
 0:06.79     cache[args] = self.func(instance, *args)
 0:06.79   File "/sources/seamonkey/seamonkey-2.53.14/python/mozbuild/mozbuild/configure/__init__.py", line 530, in _value_for_depends
 0:06.79     value = obj.result()
 0:06.79   File "/sources/seamonkey/seamonkey-2.53.14/python/mozbuild/mozbuild/util.py", line 981, in method_call
 0:06.79     cache[args] = self.func(instance, *args)
 0:06.79   File "/sources/seamonkey/seamonkey-2.53.14/python/mozbuild/mozbuild/configure/__init__.py", line 160, in result
 0:06.79     return self._func(*resolved_args)
 0:06.79   File "/sources/seamonkey/seamonkey-2.53.14/python/mozbuild/mozbuild/configure/__init__.py", line 1121, in wrapped
 0:06.79     return new_func(*args, **kwargs)
 0:06.79   File "/sources/seamonkey/seamonkey-2.53.14/python/mozbuild/mozbuild/configure/__init__.py", line 788, in wrapper
 0:06.79     ret = template(*args, **kwargs)
 0:06.79   File "/sources/seamonkey/seamonkey-2.53.14/build/moz.configure/checks.configure", line 58, in wrapped
 0:06.79     ret = func(*args, **kwargs)
 0:06.79   File "/sources/seamonkey/seamonkey-2.53.14/python/mozbuild/mozbuild/configure/__init__.py", line 1121, in wrapped
 0:06.79     return new_func(*args, **kwargs)
 0:06.79   File "/sources/seamonkey/seamonkey-2.53.14/build/moz.configure/init.configure", line 534, in virtualenv_python3
 0:06.79     manager.build(python)
 0:06.79   File "/sources/seamonkey/seamonkey-2.53.14/python/mozbuild/mozbuild/virtualenv.py", line 496, in build
 0:06.79     self.create(python)
 0:06.79   File "/sources/seamonkey/seamonkey-2.53.14/python/mozbuild/mozbuild/virtualenv.py", line 236, in create
 0:06.79     self.virtualenv_root, result))
 0:06.79 Exception: Failed to create virtualenv: /sources/seamonkey/seamonkey-2.53.14/obj-x86_64-pc-linux-gnu/_virtualenvs/init_py3 (virtualenv.py retcode: 100)
 0:06.80 *** Fix above errors and then restart with\
 0:06.80                "./mach build"
 0:06.80 make: *** [client.mk:114: configure] Error 1
