#4312 closed enhancement (fixed)
PyGObject-3.10.2
| Reported by: | Fernando de Oliveira | Owned by: | Fernando de Oliveira |
|---|---|---|---|
| Priority: | normal | Milestone: | |
| Component: | BOOK | Version: | SVN |
| Severity: | medium | Keywords: | |
| Cc: |
Change History (4)
comment:1 by , 13 years ago
| Owner: | changed from to |
|---|---|
| Status: | new → assigned |
comment:2 by , 13 years ago
Note:
See TracTickets
for help on using tickets.

Fails both for 2 and 3 modules: (here, 3 output). Add: Unknown reasons and ... -k check
====================================================================== FAIL: test_out_glist (test_atoms.TestGdkAtom) ---------------------------------------------------------------------- Traceback (most recent call last): File "/home/fernando/tmp/paco-build-2013.11.12-10h29m35s/pygobject-3.10.2/tests/test_atoms.py", line 77, in test_out_glist self.assertTrue('Rel X' in axes_names) AssertionError: False is not true ---------------------------------------------------------------------- Ran 897 tests in 10.518s FAILED (failures=1, expected failures=4)